{"text_format":"1","workbook":"xlsx","n_sheets":3,"sheets":["Activos de información - ICYR","DATA","Lista_Datos"],"not_rendered":{"charts":0,"images":3,"macros":1,"external_links":0,"defined_names":488,"comments":1,"pivot_tables":0},"unopened":[],"bounds":{"document_bytes":16777216,"sheet_cells":100000,"rows_first":2000,"rows_last":500,"rows_between":2000,"halvings":0,"cell_chars":16384,"cell_head_chars":4096},"cells_cut":0,"cells_raw":0,"read":"whole","date_system":"1900"}

{"sheet":"Activos de información - ICYR","index":0,"n_rows":235,"n_cols":22,"rows_kept":235,"cut":false,"hidden":false,"merged":[[3,16,5,21],[3,0,5,11],[3,12,5,15],[0,10,2,21],[0,3,2,7]]}
[null,null,null,"ÍNDICE DE INFORMACIÓN CLASIFICADA Y RESERVADA 2021",null,null,null,null,null,null,"ÍNDICE DE INFORMACIÓN CLASIFICADA Y RESERVADA 2021"]
[]
[]
["Identificación del Activo de Información ( Ley 594 de 2000 - Ley 1712 de 2014 - Decreto 103 de 2015 - Decreto 1080 de 2015 - Iso 27001:2013 - MIG )",null,null,null,null,null,null,null,null,null,null,null,"Valoración del Activo (Iso 27001:2013)",null,null,null,"Índice de Información Clasificada y Reservada (Decreto 103 de 2015)"]
[]
[]
["Identificador ",{"$f":"COUNTIF(B8:B235,\"LEB\")","v":0},"Tipo ","Oficina","Nombre","Descripción","Nombre del Responsable de la Producción de la Información\n(Propietario del Activo)","Fecha de Generación de la Información ","Nombre del Responsable de la Información\n(Custodio del Activo)","Medio de Conservación","Formato","Idioma","Clasificación de la Información","Cálculo C","Confidencialidad ","Cálculo I","Objetivo legítimo de la Excepción","Fundamento Constitucional o Legal","Fundamento Jurídico de la Excepción","Excepción Total o Parcial","Fecha de Calificación\nDD/MM/AAAA","Tiempo que Cobija la Clasificación"]
[">>>>>>>>>>>>>",{"$f":"IF(AND(#REF!=\"\",D8<>\"\"),\"LEB\",IF(D8<>\"\",1+#REF!,\"\"))","v":{"$error":"#REF!"}},"Información Digital","DESPACHO DEL MINISTRO","Seguimiento al Plan de Implementación de Seguridad de la información","Documento que contiene los  seguimiento de las gestiones del Sistema de Gestión de seguridad de la información del Ministerio: activos, riesgos, continuidad del servicio, Gobierno en línea, cultura incidentes de seguridad de la información y Privacidad de la información.","DESPACHO DEL MINISTRO","2020-01-31","OFICINA ASESORA DE PLANEACIÓN Y ESTUDIOS SECTORIALES","Archivos Institucionales - electrónico","Hoja de cálculo","Español","Pública Clasificada",{"$f":"+IF(O8=\"Alta\",0.5,IF(O8=\"Media\",0.3,IF(O8=\"Baja\",0.2,\"\")))","v":0.3},"Media",{"$f":"+IF(#REF!=\"Grave \",0.5,IF(#REF!=\"Importante\",0.3,IF(#REF!=\"Leve\",0.2,\"\")))","v":{"$error":"#REF!"}},"SI","Ley 1712 de 2014 artículo 18","Ley 1712 de 2014 artículo 18","Sin reserva","No Aplica","Permanente"]
[{"$f":"IF(D9<>\"\",VLOOKUP('Activos de información - ICYR'!D9,DATA!$B$2:$C$95,2,)&\"-\"&IF(ISERR(B9),\"LEB\",B9),\"\")","v":"1-LEB"},{"$f":"IF(AND(A8=\"\",D9<>\"\"),\"LEB\",IF(D9<>\"\",1+B8,\"\"))","v":{"$error":"#REF!"}},"Información Digital","DESPACHO DEL MINISTRO","Plan de continuidad de la operación ","Documentación refrente al Análisis de Impacto al Negocio - BIA, Análisis de Riesgos de Interrupción - RIA, Estrategias para la Continuidad de las Operaciones, Informe Plan de Continuidad de las Operaciones y Plan de Recuperación de Desastres Tecnológicos - DRP","DESPACHO DEL MINISTRO","2021-01-26","DESPACHO DEL MINISTRO","Sistemas de Información corporativos","PDF","Español","Pública Clasificada",{"$f":"+IF(O9=\"Alta\",0.5,IF(O9=\"Media\",0.3,IF(O9=\"Baja\",0.2,\"\")))","v":0.3},"Media",{"$f":"+IF(#REF!=\"Grave \",0.5,IF(#REF!=\"Importante\",0.3,IF(#REF!=\"Leve\",0.2,\"\")))","v":{"$error":"#REF!"}},"SI","Ley 1712 de 2014 artículo 18","Ley 1712 de 2014 artículo 18","Sin reserva","No Aplica","Permanente"]
[{"$f":"IF(D10<>\"\",VLOOKUP('Activos de información - ICYR'!D10,DATA!$B$2:$C$95,2,)&\"-\"&IF(ISERR(B10),\"LEB\",B10),\"\")","v":"12-LEB"},{"$f":"IF(AND(#REF!=\"\",D10<>\"\"),\"LEB\",IF(D10<>\"\",1+#REF!,\"\"))","v":{"$error":"#REF!"}},"Información Digital","OFICINA ASESORA DE PRENSA","Agenda de comunicaciones","Definición de la agenda de comunicaciones de acuerdo con los temas que se van a divulgar.","OFICINA ASESORA DE PRENSA","2020-10-13","OFICINA ASESORA DE PRENSA","Uso de tecnologías en la nube","XLS -PDF","Español","Pública Clasificada",{"$f":"+IF(O10=\"Alta\",0.5,IF(O10=\"Media\",0.3,IF(O10=\"Baja\",0.2,\"\")))","v":0.5},"Alta",{"$f":"+IF(#REF!=\"Grave \",0.5,IF(#REF!=\"Importante\",0.3,IF(#REF!=\"Leve\",0.2,\"\")))","v":{"$error":"#REF!"}},"SI","\nResolución 318 de 2019","Ley 1712 de 2014","Sin reserva","2020-09-23","Permanente"]
{"$rows_left_out":226}
{"sheet":"DATA","index":1,"n_rows":591,"n_cols":18,"rows_kept":591,"cut":false,"hidden":true,"merged":[]}
["Unido Unidades / Grupos de Trabajo","Unidades / Grupos de Trabajo","Código del área","Series",null,"Código de la Serie","Unido Series","Subseries",null,"Código de la Subserie",null,"Tipo_Activo","Tipo_MacroProceso","ESTRATEGICO","APOYO","EVALUACION","MISIONAL","N/A"]
[{"$f":"SUBSTITUTE(B2,\" \",\"\")","v":"DESPACHODELMINISTRO"},"DESPACHO DEL MINISTRO",1,"DERECHOS DE PETICIÓN",{"$f":"SUBSTITUTE(D2,\" \",\"_\")","v":"DERECHOS_DE_PETICIÓN"},27,{"$f":"_xlfn.CONCAT(E2,F2)","v":"DERECHOS_DE_PETICIÓN27"},"N/A","DERECHOS_DE_PETICIÓN27","N/A",null,"Información Física","ESTRATEGICO","ARQUITECTURA_INSTITUCIONAL","GESTION_RECURSOS","ANALISIS_MEJORA_GESTION","ACCESO_USO_APROPIACION_TIC","No_Aplica"]
[{"$f":"SUBSTITUTE(B3,\" \",\"\")","v":"OFICINAASESORADEPLANEACIÓNYESTUDIOSSECTORIALES"},"OFICINA ASESORA DE PLANEACIÓN Y ESTUDIOS SECTORIALES",11,"ESTATUTOS INTERNOS DEL FONDO DE TECNOLOGIAS DE LA INFORMACIÓN Y LAS COMUNICACIONES",{"$f":"SUBSTITUTE(D3,\" \",\"_\")","v":"ESTATUTOS_INTERNOS_DEL_FONDO_DE_TECNOLOGIAS_DE_LA_INFORMACIÓN_Y_LAS_COMUNICACIONES"},32,{"$f":"_xlfn.CONCAT(E3,F3)","v":"ESTATUTOS_INTERNOS_DEL_FONDO_DE_TECNOLOGIAS_DE_LA_INFORMACIÓN_Y_LAS_COMUNICACIONES32"},"N/A","ESTATUTOS_INTERNOS_DEL_FONDO_DE_TECNOLOGIAS_DE_LA_INFORMACIÓN_Y_LAS_COMUNICACIONES32","N/A",null,"Información Digital","APOYO","COMUNICACION_ESTRATEGICA","GESTION_JURIDICA",null,"GESTION_CONOCIMIENTO_SECTOR_TIC"]
[{"$f":"SUBSTITUTE(B4,\" \",\"\")","v":"GRUPOINTERNODETRABAJODEPLANEACIÓNYSEGUIMIENTO"},"GRUPO INTERNO DE TRABAJO DE PLANEACIÓN Y SEGUIMIENTO",1101,"INFORMES","INFORMES",41,"INFORMES41","INFORMES A ORGANISMOS DE CONTROL","INFORMES41","41.1",null,"Información Física – Digital","EVALUACION","COOPERACION_INTERNACIONAL",null,null,"PLANEACION_FORMULACION_POLITICAS_TIC"]
[{"$f":"SUBSTITUTE(B5,\" \",\"\")","v":"GRUPOINTERNODETRABAJODEESTADÍSTICAYESTUDIOSSECTORIALES"},"GRUPO INTERNO DE TRABAJO DE ESTADÍSTICA Y ESTUDIOS SECTORIALES",1102,"INFORMES","INFORMES",41,"INFORMES41","INFORMES DE GESTIÓN","INFORMES41","41.4",null,"Hardware","MISIONAL","GESTION_ATENCION_GRUPOS_INTERES",null,null,"SEGUIMIENTO_CONTROL_POLITICAS_TIC"]
["GRUPOINTERNODETRABAJODETRANSFORMACIÓNORGANIZACIONAL","GRUPO INTERNO DE TRABAJO DE TRANSFORMACIÓN ORGANIZACIONAL",1103,"POLITICAS","POLITICAS",61,"POLITICAS61","POLITICAS DE DIVULGACIÓN Y PROMOCIÓN DE TECNOLOGIA DE LA INFORMACIÓN Y LAS COMUNCIACIONES","POLITICAS61","61.2",null,"Software","No_Aplica","MARCO_ESTRATEGICO"]
["OFICINAASESORADEPRENSA","OFICINA ASESORA DE PRENSA",12,"PROYECTOS","PROYECTOS",65,"PROYECTOS65","PROYECTOS DE CANALES DE TELEVISIÓN ","PROYECTOS65","65.1",null,"Servicio"]
["OFICINAINTERNACIONAL","OFICINA INTERNACIONAL",13,"PROYECTOS","PROYECTOS",65,"PROYECTOS65","PROYECTOS DE LEY","PROYECTOS65","65.6",null,"Recurso Humano - P"]
["OFICINADETECNOLOGÍASDELAINFORMACIÓN","OFICINA DE TECNOLOGÍAS DE LA INFORMACIÓN",14,"ACTAS","ACTAS",2,"ACTAS2","ACTAS DE COMITÉ","ACTAS2","2.1",null,"Recurso Humano - C"]
[{"$f":"SUBSTITUTE(B10,\" \",\"\")","v":"GRUPOINTERNODETRABAJODESERVICIOSTECNOLÓGICOS"},"GRUPO INTERNO DE TRABAJO DE SERVICIOS TECNOLÓGICOS",1401,"ACTAS",{"$f":"SUBSTITUTE(D10,\" \",\"_\")","v":"ACTAS"},2,{"$f":"_xlfn.CONCAT(E10,F10)","v":"ACTAS2"},"ACTAS DE COMITÉ","ACTAS2","2.1",null,"Equipamiento Auxiliar o Soporte"]
{"$rows_left_out":582}
{"sheet":"Lista_Datos","index":2,"n_rows":480,"n_cols":68,"rows_kept":480,"cut":false,"hidden":true,"merged":[[0,65,1,65],[0,66,1,66],[0,67,1,67],[0,12,1,12],[0,15,0,18],[0,19,0,30],[0,14,1,14],[0,36,1,36],[0,37,1,37],[0,38,1,38],[0,13,1,13],[0,31,1,31],[0,32,1,32],[0,33,1,33],[0,34,1,34],[0,35,1,35],[0,0,1,0],[0,1,1,1],[0,4,1,4],[0,5,1,5],[0,6,1,6],[0,3,1,3],[0,2,1,2],[0,7,1,7],[0,8,1,8],[0,9,1,9],[0,10,1,10],[0,11,1,11],[0,52,1,52],[0,48,1,48],[0,45,1,45],[0,39,1,39],[0,40,1,40],[0,41,1,41],[0,42,1,42],[0,43,1,43],[0,44,1,44],[0,46,1,46],[0,47,1,47],[0,49,1,49],[0,50,1,50],[0,51,1,51],[0,64,1,64],[0,53,1,53],[0,54,1,54],[0,55,1,55],[0,57,1,57],[0,58,1,58],[0,59,1,59],[0,60,1,60],[0,61,1,61],[0,62,1,62],[0,63,1,63]]}
["Identificador ","Oficina","Código del área","Unidades / Grupos de Trabajo","Código de la Serie","Series","Código de la Subserie","Subseries","Nombre","Descripción","Tipo ","Nombre del Responsable de la Producción de la Información\n(Propietario del Activo)","Nombre del Responsable de la Información\n(Custodio del Activo)","Fecha de Generación de la Información o Ingreso del Activo","Tipo","Macroproceso",null,null,null,"Proceso",null,null,null,null,null,null,null,null,null,null,null,"Documento_MIG","Código Documento MIG","Norma, Ley o Función que lo Justifica ","Origen","Soporte_del_Registro","Medio_de_Conservación","Formato","Idioma","Confidencialidad","Valor","Integridad","Valor","Disponibilidad","Valor","Criticidad del Activo","Información_Publicada","Lugar de Consulta o Ubicación","Objetivo legítimo de la Excepción","Fundamento Constitucional o Legal","Fundamento Jurídico de la Excepción","Excepción_Tota_o_Parcial","Fecha de Calificación\nDD/MM/AAAA","Tiempo que Cobija la Clasificación"," ¿Contiene Datos Personales?","Tipo de Datos Personales","Finalidad de la Recoleccion de los Datos Personales","Cuenta con las  Autorizaciones para el Tratamiento de los Datos Personales","¿Existe Transferencia Internacional de Datos Personales?","¿Es un Conjunto de Datos Estratégico?","¿Es un Dato Abierto?","Tipo Clasificación de Dato Publicado","URL de Publicación en Datos.gov.co","Cobertura Geográfica","Tipo de Información","Servicio Tecnológico","Clasificación de la Información","Nivel de Seguridad"]
[null,null,null,null,null,null,null,null,null,null,null,null,null,null,null,"EVALUACION","APOYO","ESTRATEGICO","MISIONAL","ANALISIS_MEJORA_GESTION","GESTION_RECURSOS","GESTION_JURIDICA","ARQUITECTURA_INSTITUCIONAL","COMUNICACION_ESTRATEGICA","COOPERACION_INTERNACIONAL","GESTION_ATENCION_GRUPOS_INTERES","MARCO_ESTRATEGICO","ACCESO_USO_APROPIACION_TIC","GESTION_CONOCIMIENTO_SECTOR_TIC","PLANEACION_FORMULACION_POLITICAS_TIC","SEGUIMIENTO_CONTROL_POLITICAS_TIC",null,null,null,null,null,null,null,null,null,null,null,null,null,null,null,null,null,null,null,null,null,null,null,null,null,"FRDP"]
["Se Genera Automaticamente","Desp. Vice-Min de Conectividad y Digitalización",100,"DESPACHO DEL MINISTRO","100.37","ESTATUTOS INTERNOS DEL FONDO DE TECNOLOGIAS DE LA INFORMACIÓN Y LAS COMUNICACIONES",null,null,"Campo de texto","Campo de texto","INFORMACIÓN","Desp. Vice-Min de Conectividad y Digitalización","Desp. Vice-Min de Conectividad y Digitalización","Campo de Fecha","ESTRATEGICO","ANALISIS_MEJORA_GESTION","GESTION_RECURSOS","ARQUITECTURA_INSTITUCIONAL","ACCESO_USO_APROPIACION_TIC","EVALUACION Y APOYO AL CONTROL DE LA GESTION","GESTION DE COMPRAS Y CONTRATACION","GESTION JURIDICA","FORTALECIMIENTO ORGANIZACIONAL","COMUNICACION ESTRATEGICA","GESTION INTERNACIONAL","GESTION DE ATENCION A GRUPOS DE INTERES","DIRECCIONAMIENTO ESTRATEGICO","ACCESO A LAS TIC","GESTION DE LA INFORMACION SECTORIAL","PLANEACION Y FORMULACION DE POLITICAS TIC","SEGUIMIENTO Y EVALUACION DE POLITICAS TIC","SI","Campo de texto","Campo de texto","Externo","Digital","Documentos de Archivo - físicos","API","Español","Alta",{"$f":"IF(AP3=\"ALTA\",3,IF(AP3=\"MEDIA\",2,IF(AP3=\"BAJA\",1,IF(AP3=\"\",\"ESCOJA OPCION!\",3))))","v":3},"Grave ",3,"Sí",3,"ALTA","Publicada (Interno - Intranet)","Campo de texto","SI","Campo de texto","Campo de texto","Reserva parcial","Campo de Fecha","Campo de texto","SI","Dato personal privado ","a)       Permitir el desarrollo del objeto del Ministerio/Fondo TIC, en los términos del Decreto 1064 2020.","SI","SI","SI","SI","Agricultura y Desarrollo Rural","Campo de texto","INTERNACIONAL","Estructurado"," Almacenamiento ","Pública","Protegido"]
[null,"Desp. Vice-Min de Economía Digital",100,"DESPACHO DEL MINISTRO","100.47","INFORMES","100.47.01","Informes a Entes de Control y Vigilancia",null,null,"HARDWARE","Desp. Vice-Min de Economía Digital","Desp. Vice-Min de Economía Digital",null,"MISIONAL",null,"GESTION_JURIDICA","COMUNICACION_ESTRATEGICA","GESTION_CONOCIMIENTO_SECTOR_TIC",null,"GESTION DE RECURSOS ADMINISTRATIVOS",null,"SEGURIDAD Y PRIVACIDAD DE LA INFORMACIÓN",null,null,null,null,"FORTALECIMIENTO DE LA INDUSTRIA TIC","I+D+I",null,"VIGILANCIA, INSPECCION Y CONTROL","NO",null,null,"Interno","Físico","Documentos de Archivo - electrónicos","Base de datos","Francés","Media",2,"Importante",2,"No",2,"MEDIA","No publicada",null,"NO",null,null,"Reserva total",null,null,"NO","Dato personal público","b)       Desarrollar los estudios previos y procesos de selección para la contratación oficial del Ministerio/Fondo TIC destinada a garantizar el funcionamiento de la entidad y la ejecución de proyectos y el desarrollo de esquemas de gerencia de proyectos.","NO","NO","NO","NO","Ambiente y Desarrollo Sostenible",null,"NACIONAL","Semiestructurado","Comunicaciones Unificadas ","Pública Clasificada","Desprotegido"]
[null,"Despacho del Ministro ",100,"DESPACHO DEL MINISTRO","100.69","POLITICAS","100.47.02","Informes a Otros Organismos",null,null,"SOFTWARE","Despacho del Ministro ","Despacho del Ministro ",null,"APOYO",null,null,"COOPERACION_INTERNACIONAL","PLANEACION_FORMULACION_POLITICAS_TIC",null,"GESTION DEL TALENTO HUMANO",null,"GESTION DE TECNOLOGIAS DE LA INFORMACION ",null,null,null,null,"GESTION DE LA INDUSTRIA DE LAS COMUNICACIONES",null,null,null,"N/A",null,null,"N/A","N/A","Documentos de Archivo - físicos/electrónico","Hoja de cálculo","Ingles","Baja",1,"Leve",1,"No Aplica",1,"BAJA","Publicada (Externo - Internet)",null,"N/A",null,null,"Sin reserva",null,null,null,"Dato semiprivado","c)       Realizar la selección, contratación y/o vinculación de servidores públicos y contratistas de prestación de servicios de la entidad.","N/A","N/A","N/A","N/A","Ciencia, Tecnología e Innovación",null,"DEPARTAMENTAL","No estructurado","Gestión de Aplicaciones ","Pública Reservada","No Aplica"]
[null,"Dir. Apropiación de TIC",100,"DESPACHO DEL MINISTRO","100.79","PROYECTOS","100.47.16","Informes de Gestión",null,null,"SERVICIOS","Dir. Apropiación de TIC","Dir. Apropiación de TIC",null,"EVALUACION",null,null,"GESTION_ATENCION_GRUPOS_INTERES","SEGUIMIENTO_CONTROL_POLITICAS_TIC",null,"GESTION DOCUMENTAL",null,"GESTION DELCONOCIMIENTO",null,null,null,null,"USO Y APROPIACION DE LAS TIC",null,null,null,null,null,null,null,null,"Archivos Institucionales - físicos","Imagen","Inglés y Español",null,3,null,3,null,3,"ALTA","No Aplica",null,null,null,null,"N/A",null,null,null,"Datos sensibles","d)       Formular, ejecutar y evaluar los programas de salud ocupacional y planes de atención a emergencias.",null,null,null,null,"Comercio, Industria y Turismo",null,"MUNICIPAL","N/A","Gestión de Bases de Datos","No Clasificada"]
[null,"Dir. de Desarrollo de la Industria TIC",100,"DESPACHO DEL MINISTRO","101.21","CONCEPTOS","100.69.02","Politicas de Divulgación y Promoción de Tecnologia de la Información y las Comunciaciones",null,null,"RECURSO HUMANO","Dir. de Desarrollo de la Industria TIC","Dir. de Desarrollo de la Industria TIC",null,null,null,null,"MARCO_ESTRATEGICO",null,null,"GESTION FINANCIERA",null,null,null,null,null,null,null,null,null,null,null,null,null,null,null,"Archivos Institucionales - electrónico","Audio","N/A",null,null,null,null,null,null,null,null,null,null,null,null,null,null,null,null,"Datos de NNA","e)       Mantener actualizada la historia laboral y registros de nómina de funcionarios del Ministerio/Fondo TIC.",null,null,null,null,"Cultura",null,"N/A",null,"Seguridad Informática "]
[null,"Dir. de Industria de Comunicaciones",100,"DESPACHO DEL MINISTRO","101.41","EVIDENCIAS DE LA REUNIÓN DE LAS ACCIONES INSTITUCIONALES EN EL MARCO DEL CONSENSO SOCIAL","100.79.01","Proyectos de Canales de Televisión ",null,null,"INSTALACIONES","Dir. de Industria de Comunicaciones","Dir. de Industria de Comunicaciones",null,null,null," ",null,null,null,null,null,null,null,null,null,null,null,null,null,null,null,null,null,null,null,"Sistemas de Información corporativos","Video",null,null,null,null,null,null,null,null,null,null,null,null,null,null,null,null,null,"N/A","f)         Atender y resolver peticiones, quejas, reclamos y sugerencias.",null,null,null,null,"DataJam - Desarrollo Rural",null,null,null,"Servicios de Portales Web "]
[null,"Dir. de Transformación Digital",100,"DESPACHO DEL MINISTRO","101.47","INFORMES","100.79.06","Proyectos de Ley",null,null,"EQUIPAMIENTO AUXILIA","Dir. de Transformación Digital","Dir. de Transformación Digital",null,null,null,null,null,null,null,null,null,null,null,null,null,null,null,null,null,null,null,null,null,null,null,"Sistemas de Trabajo colaborativo","Software",null,null,null,null,null,null,null,null,null,null,null,null,null,null,null,null,null,null,"g)       Conservar evidencia de los eventos de entrenamiento y sensibilización realizados, audiencias de adjudicación de contratos, reuniones internas y externas.",null,null,null,null,"Datathon Latam 2017",null,null,null,"Respaldos "]
[null,"Dir. Gobierno Digital",101,"GRUPO INTERNO DE TRABAJO PARA EL CONSENSO SOCIAL","101.65","PETICIONES, QUEJAS, RECLAMOS, SUGERENCIAS Y DENUNCIAS - PQRSD","101.21.05","Conceptos Técnicos",null,null,null,"Dir. Gobierno Digital","Dir. Gobierno Digital",null,null,null,null,null,null,null,null,null,null,null,null,null,null,null,null,null,null,null,null,null,null,null,"Sistema de Administración de Documentos","Documento de Texto",null,null,null,null,null,null,null,null,null,null,null,null,null,null,null,null,null,null,"h)       Atender requerimientos de información de entes de control tanto internos como externos.",null,null,null,null,"Deporte y Recreación",null,null,null,"Redes                                                    "]
{"$rows_left_out":470}