{"text_format":"1","workbook":"xlsx","n_sheets":2,"sheets":["ACTIVOS DE INFORMACIÓN 2020","DATA"],"not_rendered":{"charts":0,"images":3,"macros":1,"external_links":13,"defined_names":452,"comments":1,"pivot_tables":0},"unopened":[],"bounds":{"document_bytes":16777216,"sheet_cells":100000,"rows_first":2000,"rows_last":500,"rows_between":2000,"halvings":0,"cell_chars":16384,"cell_head_chars":4096},"cells_cut":0,"cells_raw":0,"read":"whole","date_system":"1900"}

{"sheet":"ACTIVOS DE INFORMACIÓN 2020","index":0,"n_rows":948,"n_cols":19,"rows_kept":948,"cut":false,"hidden":false,"merged":[[3,13,5,18],[3,0,5,11],[3,12,5,12],[0,0,2,18]]}
["ÍNDICE DE INFORMACIÓN CLASIFICADA Y RESERVADA"]
[]
[]
["Identificación del Activo de Información ( Ley 594 de 2000 - Ley 1712 de 2014 - Decreto 103 de 2015 - Decreto 1080 de 2015 - Iso 27001:2013 - MIG )",null,null,null,null,null,null,null,null,null,null,null,"Valoración del Activo (Iso 27001:2013)","Índice de Información Clasificada y Reservada (Decreto 103 de 2015)"]
[]
[]
["Identificador ",{"$f":"COUNTIF(B8:B525,\"LEB\")","v":0},"Tipo ","Oficina","Nombre","Descripción","Nombre del Responsable de la Producción de la Información\n(Propietario del Activo)","Fecha de Generación de la Información ","Nombre del Responsable de la Información\n(Custodio del Activo)","Medio de Conservación","Formato","Idioma","Confidencialidad","Objetivo legítimo de la Excepción","Fundamento Constitucional o Legal","Fundamento Jurídico de la Excepción","Excepción Total o Parcial","Fecha de Calificación\nDD/MM/AAAA","Tiempo que Cobija la Clasificación"]
[{"$f":"IF(D8<>\"\",VLOOKUP('ACTIVOS DE INFORMACIÓN 2020'!D8,DATA!$E$2:$F$95,2)&\"-\"&B8,\"\")","v":"100-1"},{"$f":"IF(D8<>\"\",1,\"\")","v":1},"INFORMACIÓN","DESPACHO DEL MINISTRO","COMUNICIONES A ENTES DE CONTROL Y VIGILANCIA","Respuestas dirigidas a Fiscalia, Contraloria y Procuraduria que sean competencia del Despacho de la Ministra.","DESPACHO DEL MINISTRO","2018-11-28","DESPACHO DEL MINISTRO","Documentos de Archivo - físicos","Papel","Español","INFORMACIÓN PÚBLICA","N/A","N/A","N/A","N/A","N/A","N/A"]
[{"$f":"IF(D9<>\"\",VLOOKUP('ACTIVOS DE INFORMACIÓN 2020'!D9,DATA!$E$2:$F$95,2)&\"-\"&B9,\"\")","v":"100-2"},{"$f":"IF(AND(A8=\"\",D9<>\"\"),\"LEB\",IF(D9<>\"\",1+B8,\"\"))","v":2},"INFORMACIÓN","DESPACHO DEL MINISTRO","COMUNICACIONES DIRIGIDAS A ENTIDADES PÚBLICAS DE ORDEN NACIONAL Y/O TERRITORIAL","Respuestas emitidas a entidades de orden público de acuerdo con las competencias del Despacho de la Ministra ","DESPACHO DEL MINISTRO","2018-11-28","DESPACHO DEL MINISTRO","Documentos de Archivo - físicos","Papel","Español","INFORMACIÓN PÚBLICA","N/A","N/A","N/A","N/A","N/A","N/A"]
[{"$f":"IF(D10<>\"\",VLOOKUP('ACTIVOS DE INFORMACIÓN 2020'!D10,DATA!$E$2:$F$95,2)&\"-\"&B10,\"\")","v":"100-3"},3,"INFORMACIÓN","DESPACHO DEL MINISTRO","INFORMES DE DELEGACIÓN","Información oficial sobre el ejercicio de las dependencias  y de la entidad misma","DEPENDENCIAS","2018-11-28","DESPACHO DEL MINISTRO","Documentos de Archivo - físicos","Papel","Español","INFORMACIÓN PÚBLICA","N/A","N/A","N/A","N/A","N/A","N/A"]
[{"$f":"IF(D11<>\"\",VLOOKUP('ACTIVOS DE INFORMACIÓN 2020'!D11,DATA!$E$2:$F$95,2)&\"-\"&B11,\"\")","v":"100-4"},4,"INFORMACIÓN","DESPACHO DEL MINISTRO","COMUNICACIONES PROYECTOS CANALES DE TELEVISIÓN","Documentos dirigidos a canales nacionales","DESPACHO DEL MINISTRO","2018-11-28","DESPACHO DEL MINISTRO","Documentos de Archivo - físicos","Papel","Español","INFORMACIÓN PÚBLICA","N/A","N/A","N/A","N/A","N/A","N/A"]
[{"$f":"IF(D12<>\"\",VLOOKUP('ACTIVOS DE INFORMACIÓN 2020'!D12,DATA!$E$2:$F$95,2)&\"-\"&B12,\"\")","v":"100-5"},5,"INFORMACIÓN","DESPACHO DEL MINISTRO","ESTATUTOS","Conjunto de normas legales por las que se regula el funcionamiento del Fondo Unico TIC","DESPACHO DEL MINISTRO","2018-11-28","DESPACHO DEL MINISTRO","Documentos de Archivo - físicos","Papel","Español","INFORMACIÓN PÚBLICA","N/A","N/A","N/A","N/A","N/A","N/A"]
[{"$f":"IF(D13<>\"\",VLOOKUP('ACTIVOS DE INFORMACIÓN 2020'!D13,DATA!$E$2:$F$95,2)&\"-\"&B13,\"\")","v":"100-6"},6,"INFORMACIÓN","DESPACHO DEL MINISTRO","POLITICAS ","Conjunto de actos administrativos para promover el uso, apropiación y divulgación de las TIC","DESPACHO DEL MINISTRO","2018-11-28","DESPACHO DEL MINISTRO","Documentos de Archivo - físicos","Papel","Español","INFORMACIÓN PÚBLICA","N/A","N/A","N/A","N/A","N/A","N/A"]
[{"$f":"IF(D14<>\"\",VLOOKUP('ACTIVOS DE INFORMACIÓN 2020'!D14,DATA!$E$2:$F$95,2)&\"-\"&B14,\"\")","v":"100-7"},7,"INFORMACIÓN","DESPACHO DEL MINISTRO"," Plan de implementación de seguridad y privacidad de la información","Documento que definie los lineamientos y actividades a desarrollar en la implementación del Plan Seguridad","DESPACHO DEL MINISTRO","2020-01-31","OFICINA ASESORA DE PLANEACIÓN Y ESTUDIOS SECTORIALES","Archivos Institucionales - electrónico","PDF","Español","INFORMACIÓN PÚBLICA","N/A","N/A","N/A","N/A","N/A","N/A"]
[{"$f":"IF(D15<>\"\",VLOOKUP('ACTIVOS DE INFORMACIÓN 2020'!D15,DATA!$E$2:$F$95,2)&\"-\"&B15,\"\")","v":"100-8"},8,"INFORMACIÓN","DESPACHO DEL MINISTRO","Plan de tratamiento de riesgos de seguridad de la información","Documento que definie los lineamientos para tratar de manera integral los riesgos de Seguridad y Privacidad de la Información, Seguridad Digital y Continuidad de la Operación de los servicios","DESPACHO DEL MINISTRO","2020-01-31","OFICINA ASESORA DE PLANEACIÓN Y ESTUDIOS SECTORIALES","Archivos Institucionales - electrónico","PDF","Español","INFORMACIÓN PÚBLICA","N/A","N/A","N/A","N/A","N/A","N/A"]
[{"$f":"IF(D16<>\"\",VLOOKUP('ACTIVOS DE INFORMACIÓN 2020'!D16,DATA!$E$2:$F$95,2)&\"-\"&B16,\"\")","v":"100-9"},{"$f":"IF(AND(A15=\"\",D16<>\"\"),\"LEB\",IF(D16<>\"\",1+B15,\"\"))","v":9},"INFORMACIÓN","DESPACHO DEL MINISTRO","Seguimiento al Plan de Implementación de Seguridad de la información","Documento que contiene los  seguimiento de las gestiones del Sistema de Gestión de seguridad de la información del Ministerio: activos, riesgos, continuidad del servicio, Gobierno en línea, cultura incidentes de seguridad de la información y Privacidad de la información.","DESPACHO DEL MINISTRO","2020-01-31","OFICINA ASESORA DE PLANEACIÓN Y ESTUDIOS SECTORIALES","Archivos Institucionales - electrónico","PDF","Español","INFORMACIÓN PÚBLICA CLASIFICADA","SI","N/A","Ley 1712 de 2014 artículo 18","Sin reserva","2019-07-30","N/A"]
[{"$f":"IF(D17<>\"\",VLOOKUP('ACTIVOS DE INFORMACIÓN 2020'!D17,DATA!$E$2:$F$95,2)&\"-\"&B17,\"\")","v":"100-10"},10,"INSTALACIONES","DESPACHO DEL MINISTRO","DESPACHO DEL MINISTRO","Oficina en donde se encuentra ubicado el Ministro de Tecnologias de la Información y las comunicaciones","N/A","N/A","N/A","N/A","N/A","N/A","INFORMACIÓN PÚBLICA RESERVADA","N/A","N/A","N/A","N/A","N/A","N/A"]
[{"$f":"IF(D18<>\"\",VLOOKUP('ACTIVOS DE INFORMACIÓN 2020'!D18,DATA!$E$2:$F$95,2)&\"-\"&B18,\"\")","v":"100-11"},11,"RECURSO HUMANO","DESPACHO DEL MINISTRO","Ministro","Ministro de Tecnologías de la Información y las Comunicaciones quien lidera las iniciativas públicas para impulsar la inversión en el sector TIC y para la transformación digital del Estado","N/A","N/A","N/A","N/A","N/A","N/A","INFORMACIÓN PÚBLICA","N/A","N/A","N/A","N/A","N/A","N/A"]
[{"$f":"IF(D19<>\"\",VLOOKUP('ACTIVOS DE INFORMACIÓN 2020'!D19,DATA!$E$2:$F$95,2)&\"-\"&B19,\"\")","v":"101-12"},12,"INFORMACIÓN","GRUPO INTERNO DE TRABAJO PARA EL CONSENSO SOCIAL","SOLICITUDES Y RESPUESTAS A PQRS DE GRUPOS DE INTERES ","SOLICITUDES Y RESPUESTAS A PQRS DE GRUPOS SOCIALES Y/O ETNICOS Y DEMAS ENTIDADES DEL GOBIERNO NACIONAL","GRUPO INTERNO DE TRABAJO PARA EL CONSENSO SOCIAL","2020-09-23","GRUPO INTERNO DE TRABAJO DE FORTALECIMIENTO DE LAS RELACIONES CON LOS GRUPOS DE INTERES","Documentos de Archivo - físicos","Papel","Español","INFORMACIÓN PÚBLICA","N/A","N/A","N/A","N/A","N/A","N/A"]
[{"$f":"IF(D20<>\"\",VLOOKUP('ACTIVOS DE INFORMACIÓN 2020'!D20,DATA!$E$2:$F$95,2)&\"-\"&B20,\"\")","v":"101-13"},13,"INFORMACIÓN","GRUPO INTERNO DE TRABAJO PARA EL CONSENSO SOCIAL","Conceptos técnicos con la Solicitud y respuesta a conceptos","Conceptos internos dados por las distintas áreas del Mintic","GRUPO INTERNO DE TRABAJO PARA EL CONSENSO SOCIAL","2020-08-30","GRUPO INTERNO DE TRABAJO PARA EL CONSENSO SOCIAL","Documentos de Archivo - físicos","Papel","Español","INFORMACIÓN PÚBLICA","N/A","N/A","N/A","N/A","N/A","N/A"]
[{"$f":"IF(D21<>\"\",VLOOKUP('ACTIVOS DE INFORMACIÓN 2020'!D21,DATA!$E$2:$F$95,2)&\"-\"&B21,\"\")","v":"101-14"},14,"INFORMACIÓN","GRUPO INTERNO DE TRABAJO PARA EL CONSENSO SOCIAL","Evidencia de a atención de espacios y/o reuniones internas atendidas","Evidencia de a atención de espacios y/o reuniones internas atendidas","GRUPO INTERNO DE TRABAJO PARA EL CONSENSO SOCIAL","2020-09-24","GRUPO INTERNO DE TRABAJO PARA EL CONSENSO SOCIAL","Documentos de Archivo - físicos","Papel","Español","INFORMACIÓN PÚBLICA","N/A","N/A","N/A","N/A","N/A","N/A"]
[{"$f":"IF(D22<>\"\",VLOOKUP('ACTIVOS DE INFORMACIÓN 2020'!D22,DATA!$E$2:$F$95,2)&\"-\"&B22,\"\")","v":"101-15"},15,"INFORMACIÓN","GRUPO INTERNO DE TRABAJO PARA EL CONSENSO SOCIAL","Solicitudes y elaboración de informes o insumos para entes de control internos o externos","Solicitudes y elaboración de informes o insumos para entes de control internos o externos","GRUPO INTERNO DE TRABAJO PARA EL CONSENSO SOCIAL","2020-06-30","GRUPO INTERNO DE TRABAJO PARA EL CONSENSO SOCIAL","Documentos de Archivo - electrónicos","XLS -PDF","Español","INFORMACIÓN PÚBLICA","N/A","N/A","N/A","N/A","N/A","N/A"]
[{"$f":"IF(D23<>\"\",VLOOKUP('ACTIVOS DE INFORMACIÓN 2020'!D23,DATA!$E$2:$F$95,2)&\"-\"&B23,\"\")","v":"101-16"},16,"INFORMACIÓN","GRUPO INTERNO DE TRABAJO PARA EL CONSENSO SOCIAL","Conformación y reportes de seguimiento a planes institucionales de la entidad","Conformación y reportes de seguimiento a planes institucionales de la entidad como ASPA, Plan de Participación Ciudadana, PES, etc","GRUPO INTERNO DE TRABAJO PARA EL CONSENSO SOCIAL","2020-09-24","GRUPO INTERNO DE TRABAJO PARA EL CONSENSO SOCIAL","Archivos Institucionales - electrónico","XLS -PDF","Español","INFORMACIÓN PÚBLICA","N/A","N/A","N/A","N/A","N/A","N/A"]
[{"$f":"IF(D24<>\"\",VLOOKUP('ACTIVOS DE INFORMACIÓN 2020'!D24,DATA!$E$2:$F$95,2)&\"-\"&B24,\"\")","v":"101-17"},17,"INFORMACIÓN","GRUPO INTERNO DE TRABAJO PARA EL CONSENSO SOCIAL","Seguimiento y evaluación a Politicas Publicas TIC con grupos étnicos","Seguimiento y evaluación a Politicas Publicas TIC con grupos étnicos","GRUPO INTERNO DE TRABAJO PARA EL CONSENSO SOCIAL","2020-09-24","GRUPO INTERNO DE TRABAJO PARA EL CONSENSO SOCIAL","Documentos de Archivo - electrónicos","XLS -PDF","Español","INFORMACIÓN PÚBLICA","N/A","N/A","N/A","N/A","N/A","N/A"]
[{"$f":"IF(D25<>\"\",VLOOKUP('ACTIVOS DE INFORMACIÓN 2020'!D25,DATA!$E$2:$F$95,2)&\"-\"&B25,\"\")","v":"101-18"},18,"RECURSO HUMANO","GRUPO INTERNO DE TRABAJO PARA EL CONSENSO SOCIAL","Colaboradores Contratistas ","Coordinar las acciones constitucionales para prevenir, mitigar, y hacer seguimiento a escenarios de conflictividad social, entre otras","N/A","N/A","N/A","N/A","N/A","N/A","INFORMACIÓN PÚBLICA","N/A","N/A","N/A","N/A","N/A","N/A"]
[{"$f":"IF(D26<>\"\",VLOOKUP('ACTIVOS DE INFORMACIÓN 2020'!D26,DATA!$E$2:$F$95,2)&\"-\"&B26,\"\")","v":"101-19"},19,"RECURSO HUMANO","GRUPO INTERNO DE TRABAJO PARA EL CONSENSO SOCIAL","Colaboradores Planta","Coordinar las acciones constitucionales para prevenir, mitigar, y hacer seguimiento a escenarios de conflictividad social, entre otras","N/A","N/A","N/A","N/A","N/A","N/A","INFORMACIÓN PÚBLICA","N/A","N/A","N/A","N/A","N/A","N/A"]
[{"$f":"IF(D27<>\"\",VLOOKUP('ACTIVOS DE INFORMACIÓN 2020'!D27,DATA!$E$2:$F$95,2)&\"-\"&B27,\"\")","v":"114-20"},{"$f":"IF(AND(A26=\"\",D27<>\"\"),\"LEB\",IF(D27<>\"\",1+B26,\"\"))","v":20},"INFORMACIÓN","GRUPO INTERNO DE TRABAJO DE TRANSFORMACIÓN ORGANIZACIONAL","Matrices de recopilación de respuestas","Documento en Excel donde se recopila la información y respuestas solicitadas en FURAG","OFICINA ASESORA DE PLANEACIÓN Y ESTUDIOS SECTORIALES","2018-11-28","GRUPO INTERNO DE TRABAJO DE TRANSFORMACIÓN ORGANIZACIONAL","Documentos de Archivo - electrónicos","XLS -PDF","Español","INFORMACIÓN PÚBLICA CLASIFICADA","N/A","N/A","N/A","N/A","N/A","N/A"]
[{"$f":"IF(D28<>\"\",VLOOKUP('ACTIVOS DE INFORMACIÓN 2020'!D28,DATA!$E$2:$F$95,2)&\"-\"&B28,\"\")","v":"114-21"},21,"INFORMACIÓN","GRUPO INTERNO DE TRABAJO DE TRANSFORMACIÓN ORGANIZACIONAL","Informe de resultados","Resultados gráficos que permiten ubicar el nivel de desempeño en cada índice, resultados consolidados por entidad y los grupos par.","OFICINA ASESORA DE PLANEACIÓN Y ESTUDIOS SECTORIALES","2018-11-28","GRUPO INTERNO DE TRABAJO DE TRANSFORMACIÓN ORGANIZACIONAL","Archivos Institucionales - electrónico","PDF","Español","INFORMACIÓN PÚBLICA CLASIFICADA","N/A","N/A","N/A","N/A","N/A","N/A"]
[{"$f":"IF(D29<>\"\",VLOOKUP('ACTIVOS DE INFORMACIÓN 2020'!D29,DATA!$E$2:$F$95,2)&\"-\"&B29,\"\")","v":"114-22"},22,"INFORMACIÓN","GRUPO INTERNO DE TRABAJO DE TRANSFORMACIÓN ORGANIZACIONAL","Certificación de reporte de avance a la gestión - FURAG","Notificación generada por el sistema de la Función pública donde se evidencia el reporte FURAG realizado por la Entidad","OFICINA ASESORA DE PLANEACIÓN Y ESTUDIOS SECTORIALES","2018-11-28","GRUPO INTERNO DE TRABAJO DE TRANSFORMACIÓN ORGANIZACIONAL","Documentos de Archivo - electrónicos","PDF","Español","INFORMACIÓN PÚBLICA CLASIFICADA","N/A","N/A","N/A","N/A","N/A","N/A"]
[{"$f":"IF(D30<>\"\",VLOOKUP('ACTIVOS DE INFORMACIÓN 2020'!D30,DATA!$E$2:$F$95,2)&\"-\"&B30,\"\")","v":"114-23"},23,"INFORMACIÓN","GRUPO INTERNO DE TRABAJO DE TRANSFORMACIÓN ORGANIZACIONAL","Informe   ","Corresponde al informe y al mapa de riesgos de corrupción que se publica obedeciendo a la ley 1474 de 2011 en su articulo 73","OFICINA ASESORA DE PLANEACIÓN Y ESTUDIOS SECTORIALES","2018-11-28","GRUPO INTERNO DE TRABAJO DE TRANSFORMACIÓN ORGANIZACIONAL","Documentos de Archivo - electrónicos","PDF","Español","INFORMACIÓN PÚBLICA CLASIFICADA","N/A","N/A","N/A","N/A","N/A","N/A"]
{"$rows_left_out":919}
{"sheet":"DATA","index":1,"n_rows":591,"n_cols":19,"rows_kept":591,"cut":false,"hidden":true,"merged":[]}
[null,null,null,"Unido Unidades / Grupos de Trabajo","Unidades / Grupos de Trabajo","Código del área","Series",null,"Código de la Serie","Unido Series","Subseries","Código de la Subserie",null,"Tipo_Activo","Tipo_MacroProceso","ESTRATEGICO","APOYO","EVALUACION","MISIONAL"]
[null,null,null,{"$f":"SUBSTITUTE(E2,\" \",\"\")","v":"DESPACHODELMINISTRO"},"DESPACHO DEL MINISTRO",100,"ESTATUTOS INTERNOS DEL FONDO DE TECNOLOGIAS DE LA INFORMACIÓN Y LAS COMUNICACIONES",{"$f":"SUBSTITUTE(G2,\" \",\"_\")","v":"ESTATUTOS_INTERNOS_DEL_FONDO_DE_TECNOLOGIAS_DE_LA_INFORMACIÓN_Y_LAS_COMUNICACIONES"},10037,{"$f":"_xlfn.CONCAT(H2,I2)","v":"ESTATUTOS_INTERNOS_DEL_FONDO_DE_TECNOLOGIAS_DE_LA_INFORMACIÓN_Y_LAS_COMUNICACIONES10037"},"N/A","N/A",null,"EQUIPAMIENTO AUXILIAR","ESTRATEGICO","ARQUITECTURA_INSTITUCIONAL","GESTION_RECURSOS","ANALISIS_MEJORA_GESTION","ACCESO_USO_APROPIACION_TIC"]
[null,null,null,{"$f":"SUBSTITUTE(E3,\" \",\"\")","v":"DESPACHODELVICEMINISTRODECONECTIVIDADYDIGITALIZACIÓN"},"DESPACHO DEL VICEMINISTRO DE CONECTIVIDAD Y DIGITALIZACIÓN",200,"INFORMES",{"$f":"SUBSTITUTE(G3,\" \",\"_\")","v":"INFORMES"},10047,{"$f":"_xlfn.CONCAT(H3,I3)","v":"INFORMES10047"},"INFORMES A ENTES DE CONTROL Y VIGILANCIA","100.47.01",null,"HARDWARE","APOYO","COMUNICACION_ESTRATEGICA","GESTION_JURIDICA",null,"GESTION_CONOCIMIENTO_SECTOR_TIC"]
[null,null,null,{"$f":"SUBSTITUTE(E4,\" \",\"\")","v":"DESPACHODELVICEMINISTRODEECONOMIADIGITAL"},"DESPACHO DEL VICEMINISTRO DE ECONOMIA DIGITAL",300,"POLITICAS","POLITICAS",10069,"POLITICAS10069","INFORMES A OTROS ORGANISMOS","100.47.02",null,"INFORMACIÓN","EVALUACION","COOPERACION_INTERNACIONAL",null,null,"PLANEACION_FORMULACION_POLITICAS_TIC"]
[null,null,null,{"$f":"SUBSTITUTE(E5,\" \",\"\")","v":"DIRECCIÓNDEAPROPIACIÓNDETECNOLOGÍASDELAINFORMACIÓNYLASCOMUNICACIONES"},"DIRECCIÓN DE APROPIACIÓN DE TECNOLOGÍAS DE LA INFORMACIÓN Y LAS COMUNICACIONES",310,"PROYECTOS","PROYECTOS",10079,"PROYECTOS10079","INFORMES DE GESTIÓN","100.47.16",null,"INSTALACIONES","MISIONAL","GESTION_ATENCION_GRUPOS_INTERES",null,null,"SEGUIMIENTO_CONTROL_POLITICAS_TIC"]
[null,null,null,"DIRECCIÓNDEDESARROLLODELAINDUSTRIADETECNOLOGIASDELAINFORMACIÓN","DIRECCIÓN DE DESARROLLO DE LA INDUSTRIA DE TECNOLOGIAS DE LA INFORMACIÓN",340,"CONCEPTOS","CONCEPTOS",10121,"CONCEPTOS10121","POLITICAS DE DIVULGACIÓN Y PROMOCIÓN DE TECNOLOGIA DE LA INFORMACIÓN Y LAS COMUNCIACIONES","100.69.02",null,"RECURSO HUMANO",null,"MARCO_ESTRATEGICO"]
[null,null,null,"DIRECCIÓNDEGOBIERNODIGITAL","DIRECCIÓN DE GOBIERNO DIGITAL",320,"EVIDENCIAS DE LA REUNIÓN DE LAS ACCIONES INSTITUCIONALES EN EL MARCO DEL CONSENSO SOCIAL","EVIDENCIAS_DE_LA_REUNIÓN_DE_LAS_ACCIONES_INSTITUCIONALES_EN_EL_MARCO_DEL_CONSENSO_SOCIAL",10141,"EVIDENCIAS_DE_LA_REUNIÓN_DE_LAS_ACCIONES_INSTITUCIONALES_EN_EL_MARCO_DEL_CONSENSO_SOCIAL10141","PROYECTOS DE CANALES DE TELEVISIÓN ","100.79.01",null,"SERVICIOS"]
[null,null,null,"DIRECCIÓNDEINDUSTRIADECOMUNICACIONES","DIRECCIÓN DE INDUSTRIA DE COMUNICACIONES",210,"INFORMES","INFORMES",10147,"INFORMES10147","PROYECTOS DE LEY","100.79.06",null,"SOFTWARE"]
[null,null,null,"DIRECCIÓNDEINFRAESTUCTURA","DIRECCIÓN DE INFRAESTUCTURA",230,"PETICIONES QUEJAS RECLAMOS SUGERENCIAS Y DENUNCIAS PQRSD","PETICIONES_QUEJAS_RECLAMOS_SUGERENCIAS_Y_DENUNCIAS_PQRSD",10165,"PETICIONES_QUEJAS_RECLAMOS_SUGERENCIAS_Y_DENUNCIAS_PQRSD10165","CONCEPTOS TÉCNICOS","101.21.05"]
[null,null,null,{"$f":"SUBSTITUTE(E10,\" \",\"\")","v":"DIRECCIÓNDEPROMOCIÓNDETECNOLOGÍASDELAINFORMACIÓNYLASCOMUNICACIONES"},"DIRECCIÓN DE PROMOCIÓN DE TECNOLOGÍAS DE LA INFORMACIÓN Y LAS COMUNICACIONES",240,"PLANES",{"$f":"SUBSTITUTE(G10,\" \",\"_\")","v":"PLANES"},10166,{"$f":"_xlfn.CONCAT(H10,I10)","v":"PLANES10166"},"N/A","N/A"]
[null,null,null,"DIRECCIÓNDETRANSFORMACIÓNDIGITAL","DIRECCIÓN DE TRANSFORMACIÓN DIGITAL",330,"POLITICAS","POLITICAS",10169,"POLITICAS10169","INFORMES DE GESTIÓN","101.47.16"]
[null,null,null,"DIRECCIÓNDEVIGILANCIAYCONTROL","DIRECCIÓN DE VIGILANCIA Y CONTROL",220,"ACTAS","ACTAS",11001,"ACTAS11001","N/A","N/A"]
[null,null,null,"GRUPOINTERNODETRABAJOACTUACIONESADMINISTRATIVASYASESORIACONTRACTUAL","GRUPO INTERNO DE TRABAJO ACTUACIONES ADMINISTRATIVAS Y ASESORIA CONTRACTUAL",132,"CONCEPTOS","CONCEPTOS",11021,"CONCEPTOS11021","PLANES DE SALVAGUARDA ETNICOS","101.66.15"]
[null,null,null,"GRUPOINTERNODETRABAJODEADMINISTRACIÓNDEBIENES","GRUPO INTERNO DE TRABAJO DE ADMINISTRACIÓN DE BIENES",431,"INFORMES","INFORMES",11047,"INFORMES11047","N/A","N/A"]
[null,null,null,"GRUPOINTERNODETRABAJODEAPOYOALAGESTIÓNDECOBROCOACTIVOYGARANTIAS","GRUPO INTERNO DE TRABAJO DE APOYO A LA GESTIÓN DE COBRO COACTIVO Y GARANTIAS","211.2","MANUALES","MANUALES",11060,"MANUALES11060","ACTAS DEL COMITÉ MODELO INTEGRADO DE GESTIÓN","110.01.17"]
[null,null,null,"GRUPOINTERNODETRABAJODECARTERA","GRUPO INTERNO DE TRABAJO DE CARTERA",424,"PETICIONES QUEJAS RECLAMOS SUGERENCIAS Y DENUNCIAS PQRSD","PETICIONES_QUEJAS_RECLAMOS_SUGERENCIAS_Y_DENUNCIAS_PQRSD",11065,"PETICIONES_QUEJAS_RECLAMOS_SUGERENCIAS_Y_DENUNCIAS_PQRSD11065","ACTAS DEL COMITÉ SECTORIAL DE DESARROLLO ADMINISTRATIVO ","110.01.19"]
[null,null,null,"GRUPOINTERNODETRABAJODECIUDADESINTELIGENTES","GRUPO INTERNO DE TRABAJO DE CIUDADES INTELIGENTES","320.2","PLANES","PLANES",11066,"PLANES11066","ACTAS GRUPOS COMITÉS PRIMARIOS","110.01.26"]
[null,null,null,"GRUPOINTERNODETRABAJODECOBROCOACTIVO","GRUPO INTERNO DE TRABAJO DE COBRO COACTIVO",134,"ANTEPROYECTO DEL PRESUPUESTO DE INVERSIÓN","ANTEPROYECTO_DEL_PRESUPUESTO_DE_INVERSIÓN",11108,"ANTEPROYECTO_DEL_PRESUPUESTO_DE_INVERSIÓN11108","CONCEPTOS DE VIABILIDAD A LOS PROYECTOS DE INVERSIÓN","110.21.02"]
[null,null,null,"GRUPOINTERNODETRABAJODECOMUNICACIÓNEXTERNA","GRUPO INTERNO DE TRABAJO DE COMUNICACIÓN EXTERNA",151,"INFORMES","INFORMES",11147,"INFORMES11147","INFORMES A ENTES DE CONTROL Y VIGILANCIA","110.47.01"]
[null,null,null,"GRUPOINTERNODETRABAJODECONCEPTOS","GRUPO INTERNO DE TRABAJO DE CONCEPTOS",131,"PROYECTOS","PROYECTOS",11179,"PROYECTOS11179","INFORMES A OTROS ORGANISMOS","110.47.02"]
[null,null,null,"GRUPOINTERNODETRABAJODECONTABILIDAD","GRUPO INTERNO DE TRABAJO DE CONTABILIDAD",422,"INFORMES","INFORMES",11247,"INFORMES11247","INFORMES DE GESTIÓN","110.47.16"]
[null,null,null,"GRUPOINTERNODETRABAJODECONTRATACIÓN","GRUPO INTERNO DE TRABAJO DE CONTRATACIÓN",401,"PLANES","PLANES",11266,"PLANES11266","MANUALES DE PROCESOS Y PROCEDIMIENTOS","110.60.03"]
[null,null,null,"GRUPOINTERNODETRABAJODECONTROLINTERNODISCIPLINARIO","GRUPO INTERNO DE TRABAJO DE CONTROL INTERNO DISCIPLINARIO",402,"PROYECTOS","PROYECTOS",11279,"PROYECTOS11279","N/A","N/A"]
[null,null,null,{"$f":"SUBSTITUTE(E24,\" \",\"\")","v":"GRUPOINTERNODETRABAJODEEMPRENDIMIENTOAPPS.CO"},"GRUPO INTERNO DE TRABAJO DE EMPRENDIMIENTO APPS.CO",343,"ACTAS","ACTAS",11301,"ACTAS11301","PLANES ANTICORRUPCIÓN Y DE ATENCIÓN AL CIUDADANO","110.66.01"]
[null,null,null,"GRUPOINTERNODETRABAJODEESTADISTICASYESTUDIOSSECTORIALES","GRUPO INTERNO DE TRABAJO DE ESTADISTICAS Y ESTUDIOS SECTORIALES",113,"CERTIFICACIONES ","CERTIFICACIONES_",11314,"CERTIFICACIONES_11314","PLANES DE ATENCIÓN A VICTIMAS Y POBLACIONES VULNERABLES","110.66.06"]
[null,null,null,"GRUPOINTERNODETRABAJODEESTRATEGIATALENTODETECNOLOGIASDELAINFORMACIÓN","GRUPO INTERNO DE TRABAJO DE ESTRATEGIA TALENTO DE TECNOLOGIAS DE LA INFORMACIÓN",342,"ESTUDIOS ","ESTUDIOS_",11339,"ESTUDIOS_11339","PLANES DE EQUIDAD DE GENERO","110.66.08"]
[null,null,null,"GRUPOINTERNODETRABAJODEESTRUCTURACIÓNEINVESTIGACIÓN","GRUPO INTERNO DE TRABAJO DE ESTRUCTURACIÓN E INVESTIGACIÓN",231,"FORMULARIOS UNICOS DE REPORTE DE AVANCES DE LA GESTIÓN FURAG","FORMULARIOS_UNICOS_DE_REPORTE_DE_AVANCES_DE_LA_GESTIÓN_FURAG",11443,"FORMULARIOS_UNICOS_DE_REPORTE_DE_AVANCES_DE_LA_GESTIÓN_FURAG11443","N/A","N/A"]
[null,null,null,"GRUPOINTERNODETRABAJODEFOMENTOREGIONAL","GRUPO INTERNO DE TRABAJO DE FOMENTO REGIONAL",243,"INFORMES","INFORMES",11447,"INFORMES11447","INFORMES DE SEGUIMIENTO A  EJECUCIÓN PRESUPUESTAL","111.47.25"]
[null,null,null,"GRUPOINTERNODETRABAJODEFORTALECIMIENTODELASRELACIONESCONLOSGRUPOSDEINTERES","GRUPO INTERNO DE TRABAJO DE FORTALECIMIENTO DE LAS RELACIONES CON LOS GRUPOS DE INTERES",434,"PETICIONES QUEJAS RECLAMOS SUGERENCIAS Y DENUNCIAS PQRSD","PETICIONES_QUEJAS_RECLAMOS_SUGERENCIAS_Y_DENUNCIAS_PQRSD",11465,"PETICIONES_QUEJAS_RECLAMOS_SUGERENCIAS_Y_DENUNCIAS_PQRSD11465","PROYECTOS DE INVERSIÓN PRESUPUESTAL","111.79.04"]
[null,null,null,"GRUPOINTERNODETRABAJODEGESTIÓNDEESPECTRORADIOÉLECTRICO","GRUPO INTERNO DE TRABAJO DE GESTIÓN DE ESPECTRO RADIOÉLECTRICO","211.1","PROGRAMAS","PROGRAMAS",11478,"PROGRAMAS11478","INFORMES DE GESTIÓN","112.47"]
{"$rows_left_out":561}